Перейти к содержимому

Аудит и оптимизация QA-процессов
онлайн, начало 4 декабря
Практикум по тест-дизайну 2.0
онлайн, начало 4 декабря
Логи как инструмент тестировщика
онлайн, начало 30 ноября
Тестирование REST API
онлайн, начало 30 ноября

Публикации thepauloo89

36 публикаций создано thepauloo89 (учитываются публикации только с 30 ноября 2019)



#158005 подскажите варианты пауз для selenium intellij IDEA 14

Отправлено автор: thepauloo89 31 января 2017 - 07:36 в Selenium - Functional Testing

Привет.

 

Нужна жесткая пауза.

хотел сделать через задержку и интервал проверки, т.е. паузу в интервал проверок.

Но пауза не выполняется, после нахождения элемента всеравно сразу продалжается выполнение.

WebDriverWait wait = new WebDriverWait(browser.getDriver(), 10000, 10000);
WebElement elementik = wait.until(new ExpectedCondition<WebElement>(){
@Override
public WebElement apply(WebDriver d) {
return d.findElement(lblElement.getLocator());
}});

Не понимаю почему не работает.

на сайте http://selenium2.ru/...ced-usage.html 

описано:

 

Данный код будет либо выдаст исключение “TimeoutException” по прошествии 10 секунд, либо вернет найденный в течении 10 секунд элемент. По умолчанию “WebDriverWait” вызывает “ExpectedCondition” каждые 500 миллисекунд до тех пор, пока условие не будет удовлетворено. Условие считается удовлетворенным, если было возвращено “true” в случае булевого “ExpectedCondition” и не “null” для “ExpectedCondition” других типов.

 

т.к. не работает пауза 10000, решил попробовать паузу через интервал сделать, но тоже не работает.

 

нужна пауза равная Thread.sleep(1000);

 

что не так?

 

забыл про существование этой темы)) тему создал когда только начинал в этом всем разбираться)

сейчас делаю вот так паузу которая просто останавливает процесс, но такое использовать не рекомендуется, этот метод в главном классе описываю и потом где нужно просто вызываю

 

Пауза

public void pause(long mills) {

  try {

      Thread.sleep(mills);                 //1000 milliseconds is one second.

  } catch (InterruptedException ex) {

      Thread.currentThread().interrupt();

  }

}




#152003 Не получается запустить параллельно тесты в нужном количестве.

Отправлено автор: thepauloo89 15 июня 2016 - 08:18 в Автоматизированное тестирование

Какие версии перечисленного вы используете?

<aspect.jweaver.version>1.8.9</aspect.jweaver.version>
<selenium.server.version>2.53.0</selenium.server.version>
<junit.version>4.12</junit.version>
<allure.maven.plugin.version>2.5</allure.maven.plugin.version>
<maven.surefire.plugin>2.19.1</maven.surefire.plugin>




#152001 Не получается запустить параллельно тесты в нужном количестве.

Отправлено автор: thepauloo89 15 июня 2016 - 07:40 в Автоматизированное тестирование

Java Maven Junit 

 

При таких параметрах, запускаются все методы в классе по очереди,

 

так

<configuration>
<parallel>methods</parallel>
<threadCountMethods>4</threadCountMethods>
<testFailureIgnore>true</testFailureIgnore>

либо так

<configuration>
<parallel>methods</parallel>
<threadCount>4</threadCount>
<testFailureIgnore>true</testFailureIgnore>

 

 

При таких все классы запускаются в которых есть слово "Test"

так

<parallel>classes</parallel>
<threadCountClasses>4</threadCountClasses>
<testFailureIgnore>true</testFailureIgnore>

либо так

<parallel>classes</parallel>
<threadCount>4</threadCount>
<testFailureIgnore>true</testFailureIgnore>

 

 

Подскажите почему так происходит




#150711 как сохранять отчеты allure в нужную папку

Отправлено автор: thepauloo89 22 апреля 2016 - 06:51 в Автоматизированное тестирование

Нужно чтобы папка target создавалась не в директории проекта, а на другой машине(\\172.2.4.2\folder\folder\)

где в pom файле это прописывать?

 

 

 

<?xml version="1.0" encoding="UTF-8"?>
<project xmlns="http://maven.apache.org/POM/4.0.0"
xmlns:xsi="http://www.w3.org/20...chema-instance"
xsi:schemaLocation="http://maven.apache.org/POM/4.0.0 http://maven.apache....aven-4.0.0.xsd" >
<modelVersion>4.0.0</modelVersion>

<groupId>Test2</groupId>
<artifactId>Test2</artifactId>
<version>1.0-SNAPSHOT</version>
<properties>
<allure.version>1.4.16</allure.version>
<aspectj.version>1.8.5</aspectj.version>
</properties>

<dependencies>

<dependency>
<groupId>org.seleniumhq.selenium</groupId>
<artifactId>selenium-server</artifactId>
<version>2.53.0</version>
</dependency>

<dependency>
<groupId>org.testng</groupId>
<artifactId>testng</artifactId>
<version>6.9.10</version>
</dependency>


<dependency>
<groupId>ru.yandex.qatools.allure</groupId>
<artifactId>allure-testng-adaptor</artifactId>
<version>${allure.version}</version>
</dependency>
</dependencies>

<build>
<plugins>
<plugin>
<groupId>org.apache.maven.plugins</groupId>
<artifactId>maven-compiler-plugin</artifactId>
<version>3.5.1</version>
<configuration>
<source>1.8</source>
<target>1.8</target>
</configuration>
</plugin>
<plugin>
<groupId>org.apache.maven.plugins</groupId>
<artifactId>maven-surefire-plugin</artifactId>
<version>2.19.1</version>
<configuration>
<parallel>classes</parallel>
<threadCount>4</threadCount>
<testFailureIgnore>true</testFailureIgnore>
<argLine>
-javaagent:"${settings.localRepository}/org/aspectj/aspectjweaver/${aspectj.version}/aspectjweaver-${aspectj.version}.jar"
</argLine>

</configuration>
<dependencies>
<dependency>
<groupId>org.aspectj</groupId>
<artifactId>aspectjweaver</artifactId>
<version>${aspectj.version}</version>
</dependency>
</dependencies>
</plugin>
<plugin>
<groupId>org.eclipse.jetty</groupId>
<artifactId>jetty-maven-plugin</artifactId>
<version>9.2.10.v20150310</version>
<configuration>
<webAppSourceDirectory>${project.build.directory}/site/allure-maven-plugin</webAppSourceDirectory>
<stopKey>stop</stopKey>
<stopPort>1234</stopPort>
</configuration>
</plugin>
</plugins>
</build>
<reporting>
<excludeDefaults>true</excludeDefaults>
<plugins>
<plugin>
<groupId>ru.yandex.qatools.allure</groupId>
<artifactId>allure-maven-plugin</artifactId>
<version>2.2</version>
</plugin>
</plugins>
</reporting>
</project>




#149879 Ожидание аяксов

Отправлено автор: thepauloo89 29 марта 2016 - 10:19 в Selenium - Functional Testing

 

 

Павел, прочитайте шапку этой ветки форума и укажите что там написано.

я не совсем понял для чего это делать.

 

1. Указать какие версии вы всего чего используете. 

2. Полный стектрейс ошибки.

 

версии браузеров и вебдраивером были разные, и на самых актуальных падало, в соседней теме решили проблему.




#149758 Ожидание аяксов

Отправлено автор: thepauloo89 24 марта 2016 - 05:31 в Selenium - Functional Testing

проблема решена и она действительно из за этого метода, проверка посылала слишком много запросов и делала это каждый раз через  новые порты, тем самым их занаимая, и не успевала освобождать. добавил в метод паузу теперь при приходе проверки после каждого прохода он ждет секунду.

вот методы первый сам из за которого проблема, второй это пауза.

 

public void waitForAjaxToFinish() {
long currentTime = System.currentTimeMillis();
while (System.currentTimeMillis() - currentTime < 10000) {
boolean ajaxFinished = (Boolean) ((JavascriptExecutor) driver)
.executeScript("return !!jQuery && jQuery.active == 0");
pause(1000);
if (ajaxFinished)
return;
}

throw new AssertionError("Ajax haven't finished its job in 100 sec");
}

 

 

public void pause(long mills) {
try {
Thread.sleep(mills); //1000 milliseconds is one second.
catch (InterruptedException ex) {
Thread.currentThread().interrupt();
}
}




#149757 Ожидание аяксов

Отправлено автор: thepauloo89 24 марта 2016 - 05:28 в Selenium - Functional Testing

Павел, прочитайте шапку этой ветки форума и укажите что там написано.

я не совсем понял для чего это делать.




#149756 Ожидание аяксов

Отправлено автор: thepauloo89 24 марта 2016 - 05:28 в Selenium - Functional Testing

Гуглить то пробовали?

гуглить пробовал, там пишут что проблема в обновлении.




#149755 No buffer space available (maximum connections reached?): connect

Отправлено автор: thepauloo89 24 марта 2016 - 05:27 в Selenium - Functional Testing

проблема решена, дело было в методе который у меня проверяет все ли аяксы на странице закончены, проверка посылала слишком много запросов и делала это  каждый раз через новые порты, тем самым их занимая, и не успевала освобождать. добавил в метод паузу теперь при приходе проверки после каждого прохода он ждет секунду.

вот методы первый сам из за которого проблема, второй это пауза.

 

public void waitForAjaxToFinish() {
long currentTime = System.currentTimeMillis();
while (System.currentTimeMillis() - currentTime < 10000) {
boolean ajaxFinished = (Boolean) ((JavascriptExecutor) driver)
.executeScript("return !!jQuery && jQuery.active == 0");
pause(1000);
if (ajaxFinished)
return;
}

throw new AssertionError("Ajax haven't finished its job in 100 sec");
}

 

 

public void pause(long mills) {
try {
Thread.sleep(mills); //1000 milliseconds is one second.
} catch (InterruptedException ex) {
Thread.currentThread().interrupt();
}
}




#149728 No buffer space available (maximum connections reached?): connect

Отправлено автор: thepauloo89 23 марта 2016 - 06:43 в Selenium - Functional Testing

я имею ввиду версию самих браузеров, а не chromedriver.

Попробуй обновить браузеры в общем и перезагрузиться.

Chrome новый и webdriver новый,

FF новый так же




#149695 No buffer space available (maximum connections reached?): connect

Отправлено автор: thepauloo89 22 марта 2016 - 12:53 в Selenium - Functional Testing

Latest Release: ChromeDriver 2.21

Supports Chrome v46-50
и  FF только что скачал новую



#149688 No buffer space available (maximum connections reached?): connect

Отправлено автор: thepauloo89 22 марта 2016 - 12:15 в Selenium - Functional Testing

версии вёбдрайвера и браузеров последние?

обновил WebDraiver хрома и FF ничего не изменилось(




#149684 No buffer space available (maximum connections reached?): connect

Отправлено автор: thepauloo89 22 марта 2016 - 11:13 в Selenium - Functional Testing

Есть подозрение, что это проблема реализации в связке селениум-файрфокс:
https://github.com/s...nium/issues/878
https://github.com/S...ium/issues/1188

Попробуйте проверить в другом браузере, не на файрфоксе

началось это на хроме, потом пробовал и IE

ошибка не от браузера




#149679 No buffer space available (maximum connections reached?): connect

Отправлено автор: thepauloo89 22 марта 2016 - 10:45 в Selenium - Functional Testing

после перезагрузки проблема на время исчезает ведь?

нет после перезагрузки не исчезает, в процессах драйвер закрывается, когда была команда driver.close то он висел в процессах, исправил на driver.quit теперь в процессах драйвера нет, плюс я очищаю процессы перед запуском.




#149675 No buffer space available (maximum connections reached?): connect

Отправлено автор: thepauloo89 22 марта 2016 - 10:37 в Selenium - Functional Testing

ну там не должно быть много (тысячи) открытых соединений.

 

Если их много, то надо разбираться какое ПО их открывает. Если их мало, то вы не до конца пофиксили багу о которой говориться в первых 10 ссылках если гуглить текст ошибки.

так я понимаю что не пофиксил, в нем вот такого много        TIME_WAIT

  TCP    127.0.0.1:58954        127.0.0.1:7055         TIME_WAIT
  TCP    127.0.0.1:58955        127.0.0.1:7055         TIME_WAIT
  TCP    127.0.0.1:58956        127.0.0.1:7055         TIME_WAIT
  TCP    127.0.0.1:58957        127.0.0.1:7055         TIME_WAIT
  TCP    127.0.0.1:58958        127.0.0.1:7055         TIME_WAIT
  TCP    127.0.0.1:58959        127.0.0.1:7055         TIME_WAIT
  TCP    127.0.0.1:58960        127.0.0.1:7055         TIME_WAIT
  TCP    127.0.0.1:58961        127.0.0.1:7055         TIME_WAIT
  TCP    127.0.0.1:58962        127.0.0.1:7055         TIME_WAIT
  TCP    127.0.0.1:58963        127.0.0.1:7055         TIME_WAIT
  TCP    127.0.0.1:58964        127.0.0.1:7055         TIME_WAIT
  TCP    127.0.0.1:58965        127.0.0.1:7055         TIME_WAIT
  TCP    127.0.0.1:58966        127.0.0.1:7055         TIME_WAIT
  TCP    127.0.0.1:58967        127.0.0.1:7055         TIME_WAIT
  TCP    127.0.0.1:58968        127.0.0.1:7055         TIME_WAIT
  TCP    127.0.0.1:58969        127.0.0.1:7055         TIME_WAIT
  TCP    127.0.0.1:58970        127.0.0.1:7055         TIME_WAIT
  TCP    127.0.0.1:58971        127.0.0.1:7055         TIME_WAIT
  TCP    127.0.0.1:58972        127.0.0.1:7055         TIME_WAIT
  TCP    127.0.0.1:58973        127.0.0.1:7055         TIME_WAIT
  TCP    127.0.0.1:58974        127.0.0.1:7055         TIME_WAIT
  TCP    127.0.0.1:58975        127.0.0.1:7055         TIME_WAIT
  TCP    127.0.0.1:58976        127.0.0.1:7055         TIME_WAIT
  TCP    127.0.0.1:58977        127.0.0.1:7055         TIME_WAIT
  TCP    127.0.0.1:58978        127.0.0.1:7055         TIME_WAIT
  TCP    127.0.0.1:58979        127.0.0.1:7055         TIME_WAIT
  TCP    127.0.0.1:58980        127.0.0.1:7055         TIME_WAIT
  TCP    127.0.0.1:58981        127.0.0.1:7055         TIME_WAIT
  TCP    127.0.0.1:58982        127.0.0.1:7055         TIME_WAIT
  TCP    127.0.0.1:58983        127.0.0.1:7055         TIME_WAIT
  TCP    127.0.0.1:58984        127.0.0.1:7055         TIME_WAIT
  TCP    127.0.0.1:58985        127.0.0.1:7055         TIME_WAIT
  TCP    127.0.0.1:58986        127.0.0.1:7055         TIME_WAIT
  TCP    127.0.0.1:58987        127.0.0.1:7055         TIME_WAIT
  TCP    127.0.0.1:58988        127.0.0.1:7055         TIME_WAIT
  TCP    127.0.0.1:58989        127.0.0.1:7055         TIME_WAIT
  TCP    127.0.0.1:58990        127.0.0.1:7055         TIME_WAIT
  TCP    127.0.0.1:58991        127.0.0.1:7055         TIME_WAIT
  TCP    127.0.0.1:58992        127.0.0.1:7055         TIME_WAIT
  TCP    127.0.0.1:58993        127.0.0.1:7055         TIME_WAIT
  TCP    127.0.0.1:58994        127.0.0.1:7055         TIME_WAIT
  TCP    127.0.0.1:58995        127.0.0.1:7055         TIME_WAIT
  TCP    127.0.0.1:58996        127.0.0.1:7055         TIME_WAIT
  TCP    127.0.0.1:58997        127.0.0.1:7055         TIME_WAIT
  TCP    127.0.0.1:58998        127.0.0.1:7055         TIME_WAIT
  TCP    127.0.0.1:58999        127.0.0.1:7055         TIME_WAIT
  TCP    127.0.0.1:59000        127.0.0.1:7055         TIME_WAIT
  TCP    127.0.0.1:59001        127.0.0.1:7055         TIME_WAIT
  TCP    127.0.0.1:59002        127.0.0.1:7055         TIME_WAIT
  TCP    127.0.0.1:59003        127.0.0.1:7055         TIME_WAIT
  TCP    127.0.0.1:59004        127.0.0.1:7055         TIME_WAIT
  TCP    127.0.0.1:59005        127.0.0.1:7055         TIME_WAIT
  TCP    127.0.0.1:59006        127.0.0.1:7055         TIME_WAIT
  TCP    127.0.0.1:59007        127.0.0.1:7055         TIME_WAIT
  TCP    127.0.0.1:59008        127.0.0.1:7055         TIME_WAIT
  TCP    127.0.0.1:59009        127.0.0.1:7055         TIME_WAIT
  TCP    127.0.0.1:59010        127.0.0.1:7055         TIME_WAIT
  TCP    127.0.0.1:59011        127.0.0.1:7055         TIME_WAIT
  TCP    127.0.0.1:59012        127.0.0.1:7055         TIME_WAIT
  TCP    127.0.0.1:59013        127.0.0.1:7055         TIME_WAIT
  TCP    127.0.0.1:59014        127.0.0.1:7055         TIME_WAIT
  TCP    127.0.0.1:59015        127.0.0.1:7055         TIME_WAIT
  TCP    127.0.0.1:59016        127.0.0.1:7055         TIME_WAIT
  TCP    127.0.0.1:59017        127.0.0.1:7055         TIME_WAIT
  TCP    127.0.0.1:59018        127.0.0.1:7055         TIME_WAIT
  TCP    127.0.0.1:59019        127.0.0.1:7055         TIME_WAIT
  TCP    127.0.0.1:59020        127.0.0.1:7055         TIME_WAIT
  TCP    127.0.0.1:59021        127.0.0.1:7055         TIME_WAIT
  TCP    127.0.0.1:59022        127.0.0.1:7055         TIME_WAIT
  TCP    127.0.0.1:59023        127.0.0.1:7055         TIME_WAIT
  TCP    127.0.0.1:59024        127.0.0.1:7055         TIME_WAIT
  TCP    127.0.0.1:59025        127.0.0.1:7055         TIME_WAIT
  TCP    127.0.0.1:59026        127.0.0.1:7055         TIME_WAIT
  TCP    127.0.0.1:59027        127.0.0.1:7055         TIME_WAIT
  TCP    127.0.0.1:59028        127.0.0.1:7055         TIME_WAIT
  TCP    127.0.0.1:59029        127.0.0.1:7055         TIME_WAIT
  TCP    127.0.0.1:59030        127.0.0.1:7055         TIME_WAIT
  TCP    127.0.0.1:59031        127.0.0.1:7055         TIME_WAIT
  TCP    127.0.0.1:59032        127.0.0.1:7055         TIME_WAIT
  TCP    127.0.0.1:59033        127.0.0.1:7055         TIME_WAIT
  TCP    127.0.0.1:59034        127.0.0.1:7055         TIME_WAIT
  TCP    127.0.0.1:59035        127.0.0.1:7055         TIME_WAIT
  TCP    127.0.0.1:59036        127.0.0.1:7055         TIME_WAIT
  TCP    127.0.0.1:59037        127.0.0.1:7055         TIME_WAIT
  TCP    127.0.0.1:59038        127.0.0.1:7055         TIME_WAIT
  TCP    127.0.0.1:59039        127.0.0.1:7055         TIME_WAIT
  TCP    127.0.0.1:59040        127.0.0.1:7055         TIME_WAIT
  TCP    127.0.0.1:59041        127.0.0.1:7055         TIME_WAIT
  TCP    127.0.0.1:59042        127.0.0.1:7055         TIME_WAIT
  TCP    127.0.0.1:59043        127.0.0.1:7055         TIME_WAIT
  TCP    127.0.0.1:59044        127.0.0.1:7055         TIME_WAIT
  TCP    127.0.0.1:59045        127.0.0.1:7055         TIME_WAIT
  TCP    127.0.0.1:59046        127.0.0.1:7055         TIME_WAIT
  TCP    127.0.0.1:59047        127.0.0.1:7055         TIME_WAIT
  TCP    127.0.0.1:59048        127.0.0.1:7055         TIME_WAIT
  TCP    127.0.0.1:59049        127.0.0.1:7055         TIME_WAIT
  TCP    127.0.0.1:59050        127.0.0.1:7055         TIME_WAIT
  TCP    127.0.0.1:59051        127.0.0.1:7055         TIME_WAIT
  TCP    127.0.0.1:59052        127.0.0.1:7055         TIME_WAIT
  TCP    127.0.0.1:59053        127.0.0.1:7055         TIME_WAIT
  TCP    127.0.0.1:59054        127.0.0.1:7055         TIME_WAIT
  TCP    127.0.0.1:59055        127.0.0.1:7055         TIME_WAIT
  TCP    127.0.0.1:59056        127.0.0.1:7055         TIME_WAIT
  TCP    127.0.0.1:59057        127.0.0.1:7055         TIME_WAIT
  TCP    127.0.0.1:59058        127.0.0.1:7055         TIME_WAIT
  TCP    127.0.0.1:59059        127.0.0.1:7055         TIME_WAIT
  TCP    127.0.0.1:59060        127.0.0.1:7055         TIME_WAIT
  TCP    127.0.0.1:59061        127.0.0.1:7055         TIME_WAIT
  TCP    127.0.0.1:59062        127.0.0.1:7055         TIME_WAIT
  TCP    127.0.0.1:59063        127.0.0.1:7055         TIME_WAIT
  TCP    127.0.0.1:59064        127.0.0.1:7055         TIME_WAIT
  TCP    127.0.0.1:59065        127.0.0.1:7055         TIME_WAIT
  TCP    127.0.0.1:59066        127.0.0.1:7055         TIME_WAIT
  TCP    127.0.0.1:59067        127.0.0.1:7055         TIME_WAIT
  TCP    127.0.0.1:59068        127.0.0.1:7055         TIME_WAIT
  TCP    127.0.0.1:59069        127.0.0.1:7055         TIME_WAIT
  TCP    127.0.0.1:59070        127.0.0.1:7055         TIME_WAIT
  TCP    127.0.0.1:59071        127.0.0.1:7055         TIME_WAIT
  TCP    127.0.0.1:59072        127.0.0.1:7055         TIME_WAIT
  TCP    127.0.0.1:59073        127.0.0.1:7055         TIME_WAIT
  TCP    127.0.0.1:59074        127.0.0.1:7055         TIME_WAIT
  TCP    127.0.0.1:59075        127.0.0.1:7055         TIME_WAIT
  TCP    127.0.0.1:59076        127.0.0.1:7055         TIME_WAIT
  TCP    127.0.0.1:59077        127.0.0.1:7055         TIME_WAIT
  TCP    127.0.0.1:59078        127.0.0.1:7055         TIME_WAIT
  TCP    127.0.0.1:59079        127.0.0.1:7055         TIME_WAIT
  TCP    127.0.0.1:59080        127.0.0.1:7055         TIME_WAIT
  TCP    127.0.0.1:59081        127.0.0.1:7055         TIME_WAIT
  TCP    127.0.0.1:59082        127.0.0.1:7055         TIME_WAIT
  TCP    127.0.0.1:59083        127.0.0.1:7055         TIME_WAIT
  TCP    127.0.0.1:59084        127.0.0.1:7055         TIME_WAIT
  TCP    127.0.0.1:59085        127.0.0.1:7055         TIME_WAIT
  TCP    127.0.0.1:59086        127.0.0.1:7055         TIME_WAIT
  TCP    127.0.0.1:59087        127.0.0.1:7055         TIME_WAIT
  TCP    127.0.0.1:59088        127.0.0.1:7055         TIME_WAIT
  TCP    127.0.0.1:59089        127.0.0.1:7055         TIME_WAIT
  TCP    127.0.0.1:59090        127.0.0.1:7055         TIME_WAIT
  TCP    127.0.0.1:59091        127.0.0.1:7055         TIME_WAIT
  TCP    127.0.0.1:59092        127.0.0.1:7055         TIME_WAIT
  TCP    127.0.0.1:59093        127.0.0.1:7055         TIME_WAIT
  TCP    127.0.0.1:59094        127.0.0.1:7055         TIME_WAIT
  TCP    127.0.0.1:59095        127.0.0.1:7055         TIME_WAIT
  TCP    127.0.0.1:59096        127.0.0.1:7055         TIME_WAIT
  TCP    127.0.0.1:59097        127.0.0.1:7055         TIME_WAIT
  TCP    127.0.0.1:59098        127.0.0.1:7055         TIME_WAIT
  TCP    127.0.0.1:59099        127.0.0.1:7055         TIME_WAIT
  TCP    127.0.0.1:59100        127.0.0.1:7055         TIME_WAIT
  TCP    127.0.0.1:59101        127.0.0.1:7055         TIME_WAIT
  TCP    127.0.0.1:59102        127.0.0.1:7055         TIME_WAIT
  TCP    127.0.0.1:59103        127.0.0.1:7055         TIME_WAIT
  TCP    127.0.0.1:59104        127.0.0.1:7055         TIME_WAIT
  TCP    127.0.0.1:59105        127.0.0.1:7055         TIME_WAIT
  TCP    127.0.0.1:59106        127.0.0.1:7055         TIME_WAIT
  TCP    127.0.0.1:59107        127.0.0.1:7055         TIME_WAIT
  TCP    127.0.0.1:59108        127.0.0.1:7055         TIME_WAIT
  TCP    127.0.0.1:59109        127.0.0.1:7055         TIME_WAIT
  TCP    127.0.0.1:59110        127.0.0.1:7055         TIME_WAIT
  TCP    127.0.0.1:59111        127.0.0.1:7055         TIME_WAIT
  TCP    127.0.0.1:59112        127.0.0.1:7055         TIME_WAIT
  TCP    127.0.0.1:59113        127.0.0.1:7055         TIME_WAIT
  TCP    127.0.0.1:59114        127.0.0.1:7055         TIME_WAIT
  TCP    127.0.0.1:59115        127.0.0.1:7055         TIME_WAIT
  TCP    127.0.0.1:59116        127.0.0.1:7055         TIME_WAIT
  TCP    127.0.0.1:59117        127.0.0.1:7055         TIME_WAIT
  TCP    127.0.0.1:59118        127.0.0.1:7055         TIME_WAIT
  TCP    127.0.0.1:59119        127.0.0.1:7055         TIME_WAIT
  TCP    127.0.0.1:59120        127.0.0.1:7055         TIME_WAIT
  TCP    127.0.0.1:59121        127.0.0.1:7055         TIME_WAIT
  TCP    127.0.0.1:59122        127.0.0.1:7055         TIME_WAIT
  TCP    127.0.0.1:59123        127.0.0.1:7055         TIME_WAIT
  TCP    127.0.0.1:59124        127.0.0.1:7055         TIME_WAIT
  TCP    127.0.0.1:59125        127.0.0.1:7055         TIME_WAIT
  TCP    127.0.0.1:59126        127.0.0.1:7055         TIME_WAIT
  TCP    127.0.0.1:59127        127.0.0.1:7055         TIME_WAIT
  TCP    127.0.0.1:59128        127.0.0.1:7055         TIME_WAIT
  TCP    127.0.0.1:59129        127.0.0.1:7055         TIME_WAIT
  TCP    127.0.0.1:59130        127.0.0.1:7055         TIME_WAIT
  TCP    127.0.0.1:59131        127.0.0.1:7055         TIME_WAIT
  TCP    127.0.0.1:59132        127.0.0.1:7055         TIME_WAIT
  TCP    127.0.0.1:59133        127.0.0.1:7055         TIME_WAIT
  TCP    127.0.0.1:59134        127.0.0.1:7055         TIME_WAIT
  TCP    127.0.0.1:59135        127.0.0.1:7055         TIME_WAIT
  TCP    127.0.0.1:59136        127.0.0.1:7055         TIME_WAIT
  TCP    127.0.0.1:59137        127.0.0.1:7055         TIME_WAIT
  TCP    127.0.0.1:59138        127.0.0.1:7055         TIME_WAIT
  TCP    127.0.0.1:59139        127.0.0.1:7055         TIME_WAIT
  TCP    127.0.0.1:59140        127.0.0.1:7055         TIME_WAIT
  TCP    127.0.0.1:59141        127.0.0.1:7055         TIME_WAIT
  TCP    127.0.0.1:59142        127.0.0.1:7055         TIME_WAIT
  TCP    127.0.0.1:59143        127.0.0.1:7055         TIME_WAIT
  TCP    127.0.0.1:59144        127.0.0.1:7055         TIME_WAIT
  TCP    127.0.0.1:59145        127.0.0.1:7055         TIME_WAIT
  TCP    127.0.0.1:59146        127.0.0.1:7055         TIME_WAIT
  TCP    127.0.0.1:59147        127.0.0.1:7055         TIME_WAIT
  TCP    127.0.0.1:59148        127.0.0.1:7055         TIME_WAIT
  TCP    127.0.0.1:59149        127.0.0.1:7055         TIME_WAIT
  TCP    127.0.0.1:59150        127.0.0.1:7055         TIME_WAIT
  TCP    127.0.0.1:59151        127.0.0.1:7055         TIME_WAIT
  TCP    127.0.0.1:59152        127.0.0.1:7055         TIME_WAIT
  TCP    127.0.0.1:59153        127.0.0.1:7055         TIME_WAIT
  TCP    127.0.0.1:59154        127.0.0.1:7055         TIME_WAIT
  TCP    127.0.0.1:59155        127.0.0.1:7055         TIME_WAIT
  TCP    127.0.0.1:59156        127.0.0.1:7055         TIME_WAIT
  TCP    127.0.0.1:59157        127.0.0.1:7055         TIME_WAIT
  TCP    127.0.0.1:59158        127.0.0.1:7055         TIME_WAIT
  TCP    127.0.0.1:59159        127.0.0.1:7055         TIME_WAIT
  TCP    127.0.0.1:59160        127.0.0.1:7055         TIME_WAIT
  TCP    127.0.0.1:59161        127.0.0.1:7055         TIME_WAIT
  TCP    127.0.0.1:59162        127.0.0.1:7055         TIME_WAIT
  TCP    127.0.0.1:59163        127.0.0.1:7055         TIME_WAIT
  TCP    127.0.0.1:59164        127.0.0.1:7055         TIME_WAIT
  TCP    127.0.0.1:59165        127.0.0.1:7055         TIME_WAIT
  TCP    127.0.0.1:59166        127.0.0.1:7055         TIME_WAIT
  TCP    127.0.0.1:59167        127.0.0.1:7055         TIME_WAIT
  TCP    127.0.0.1:59168        127.0.0.1:7055         TIME_WAIT
  TCP    127.0.0.1:59169        127.0.0.1:7055         TIME_WAIT
  TCP    127.0.0.1:59170        127.0.0.1:7055         TIME_WAIT
  TCP    127.0.0.1:59171        127.0.0.1:7055         TIME_WAIT
  TCP    127.0.0.1:59172        127.0.0.1:7055         TIME_WAIT
  TCP    127.0.0.1:59173        127.0.0.1:7055         TIME_WAIT
  TCP    127.0.0.1:59174        127.0.0.1:7055         TIME_WAIT
  TCP    127.0.0.1:59175        127.0.0.1:7055         TIME_WAIT
  TCP    127.0.0.1:59176        127.0.0.1:7055         TIME_WAIT
  TCP    127.0.0.1:59177        127.0.0.1:7055         TIME_WAIT
  TCP    127.0.0.1:59178        127.0.0.1:7055         TIME_WAIT
  TCP    127.0.0.1:59179        127.0.0.1:7055         TIME_WAIT
  TCP    127.0.0.1:59180        127.0.0.1:7055         TIME_WAIT
  TCP    127.0.0.1:59181        127.0.0.1:7055         TIME_WAIT
  TCP    127.0.0.1:59182        127.0.0.1:7055         TIME_WAIT
  TCP    127.0.0.1:59183        127.0.0.1:7055         TIME_WAIT
  TCP    127.0.0.1:59184        127.0.0.1:7055         TIME_WAIT
  TCP    127.0.0.1:59185        127.0.0.1:7055         TIME_WAIT
  TCP    127.0.0.1:59186        127.0.0.1:7055         TIME_WAIT
  TCP    127.0.0.1:59187        127.0.0.1:7055         TIME_WAIT
  TCP    127.0.0.1:59188        127.0.0.1:7055         TIME_WAIT
  TCP    127.0.0.1:59189        127.0.0.1:7055         TIME_WAIT
  TCP    127.0.0.1:59190        127.0.0.1:7055         TIME_WAIT
  TCP    127.0.0.1:59191        127.0.0.1:7055         TIME_WAIT
  TCP    127.0.0.1:59192        127.0.0.1:7055         TIME_WAIT
  TCP    127.0.0.1:59193        127.0.0.1:7055         TIME_WAIT
  TCP    127.0.0.1:59194        127.0.0.1:7055         TIME_WAIT
  TCP    127.0.0.1:59195        127.0.0.1:7055         TIME_WAIT
  TCP    127.0.0.1:59196        127.0.0.1:7055         TIME_WAIT
  TCP    127.0.0.1:59197        127.0.0.1:7055         TIME_WAIT
  TCP    127.0.0.1:59198        127.0.0.1:7055         TIME_WAIT
  TCP    127.0.0.1:59199        127.0.0.1:7055         TIME_WAIT
  TCP    127.0.0.1:59200        127.0.0.1:7055         TIME_WAIT
  TCP    127.0.0.1:59201        127.0.0.1:7055         TIME_WAIT
  TCP    127.0.0.1:59202        127.0.0.1:7055         TIME_WAIT
  TCP    127.0.0.1:59203        127.0.0.1:7055         TIME_WAIT
  TCP    127.0.0.1:59204        127.0.0.1:7055         TIME_WAIT
  TCP    127.0.0.1:59205        127.0.0.1:7055         TIME_WAIT
  TCP    127.0.0.1:59206        127.0.0.1:7055         TIME_WAIT
  TCP    127.0.0.1:59207        127.0.0.1:7055         TIME_WAIT
  TCP    127.0.0.1:59208        127.0.0.1:7055         TIME_WAIT
  TCP    127.0.0.1:59209        127.0.0.1:7055         TIME_WAIT
  TCP    127.0.0.1:59210        127.0.0.1:7055         TIME_WAIT
  TCP    127.0.0.1:59211        127.0.0.1:7055         TIME_WAIT
  TCP    127.0.0.1:59212        127.0.0.1:7055         TIME_WAIT
  TCP    127.0.0.1:59213        127.0.0.1:7055         TIME_WAIT
  TCP    127.0.0.1:59214        127.0.0.1:7055         TIME_WAIT
  TCP    127.0.0.1:59215        127.0.0.1:7055         TIME_WAIT
  TCP    127.0.0.1:59216        127.0.0.1:7055         TIME_WAIT
  TCP    127.0.0.1:59217        127.0.0.1:7055         TIME_WAIT
  TCP    127.0.0.1:59218        127.0.0.1:7055         TIME_WAIT
  TCP    127.0.0.1:59219        127.0.0.1:7055         TIME_WAIT
  TCP    127.0.0.1:59220        127.0.0.1:7055         TIME_WAIT
  TCP    127.0.0.1:59221        127.0.0.1:7055         TIME_WAIT
  TCP    127.0.0.1:59222        127.0.0.1:7055         TIME_WAIT
  TCP    127.0.0.1:59223        127.0.0.1:7055         TIME_WAIT
  TCP    127.0.0.1:59229        127.0.0.1:7055         TIME_WAIT
  TCP    127.0.0.1:59230        127.0.0.1:7055         TIME_WAIT
  TCP    127.0.0.1:59231        127.0.0.1:7055         TIME_WAIT
  TCP    127.0.0.1:59232        127.0.0.1:7055         TIME_WAIT
  TCP    127.0.0.1:59233        127.0.0.1:7055         TIME_WAIT
  TCP    127.0.0.1:59234        127.0.0.1:7055         TIME_WAIT
  TCP    127.0.0.1:59235        127.0.0.1:7055         TIME_WAIT
  TCP    127.0.0.1:59236        127.0.0.1:7055         TIME_WAIT
  TCP    127.0.0.1:59237        127.0.0.1:7055         TIME_WAIT
  TCP    127.0.0.1:59238        127.0.0.1:7056         TIME_WAIT
  TCP    127.0.0.1:59248        127.0.0.1:7056         TIME_WAIT
  TCP    127.0.0.1:59252        127.0.0.1:7056         TIME_WAIT
  TCP    127.0.0.1:59254        127.0.0.1:7056         TIME_WAIT
  TCP    127.0.0.1:59260        127.0.0.1:7056         TIME_WAIT
  TCP    127.0.0.1:59261        127.0.0.1:7056         TIME_WAIT
  TCP    127.0.0.1:59262        127.0.0.1:7056         TIME_WAIT
  TCP    127.0.0.1:59263        127.0.0.1:7056         TIME_WAIT
  TCP    127.0.0.1:59264        127.0.0.1:7056         TIME_WAIT
  TCP    127.0.0.1:59265        127.0.0.1:7056         TIME_WAIT
  TCP    127.0.0.1:59266        127.0.0.1:7056         TIME_WAIT
  TCP    127.0.0.1:59267        127.0.0.1:7056         TIME_WAIT
  TCP    127.0.0.1:59268        127.0.0.1:7056         TIME_WAIT
  TCP    127.0.0.1:59280        127.0.0.1:7056         TIME_WAIT
  TCP    127.0.0.1:59281        127.0.0.1:7056         TIME_WAIT
  TCP    127.0.0.1:59282        127.0.0.1:7056         TIME_WAIT
  TCP    127.0.0.1:59283        127.0.0.1:7056         TIME_WAIT
  TCP    127.0.0.1:59284        127.0.0.1:7056         TIME_WAIT
  TCP    127.0.0.1:59285        127.0.0.1:7056         TIME_WAIT
  TCP    127.0.0.1:59286        127.0.0.1:7056         TIME_WAIT
  TCP    127.0.0.1:59287        127.0.0.1:7056         TIME_WAIT
  TCP    127.0.0.1:59288        127.0.0.1:7056         TIME_WAIT
  TCP    127.0.0.1:59289        127.0.0.1:7056         TIME_WAIT
  TCP    127.0.0.1:59290        127.0.0.1:7056         TIME_WAIT
  TCP    127.0.0.1:59291        127.0.0.1:7056         TIME_WAIT
  TCP    127.0.0.1:59292        127.0.0.1:7056         TIME_WAIT
  TCP    127.0.0.1:59293        127.0.0.1:7056         TIME_WAIT
  TCP    127.0.0.1:59294        127.0.0.1:7056         TIME_WAIT
  TCP    127.0.0.1:59295        127.0.0.1:7056         TIME_WAIT
  TCP    127.0.0.1:59296        127.0.0.1:7056         TIME_WAIT
  TCP    127.0.0.1:59297        127.0.0.1:7056         TIME_WAIT
  TCP    127.0.0.1:59298        127.0.0.1:7056         TIME_WAIT
  TCP    127.0.0.1:59299        127.0.0.1:7056         TIME_WAIT
  TCP    127.0.0.1:59300        127.0.0.1:7056         TIME_WAIT
  TCP    127.0.0.1:59301        127.0.0.1:7056         TIME_WAIT
  TCP    127.0.0.1:59302        127.0.0.1:7056         TIME_WAIT
  TCP    127.0.0.1:59303        127.0.0.1:7056         TIME_WAIT
  TCP    127.0.0.1:59304        127.0.0.1:7056         TIME_WAIT
  TCP    127.0.0.1:59305        127.0.0.1:7056         TIME_WAIT
  TCP    127.0.0.1:59306        127.0.0.1:7056         TIME_WAIT
  TCP    127.0.0.1:59307        127.0.0.1:7056         TIME_WAIT
  TCP    127.0.0.1:59308        127.0.0.1:7056         TIME_WAIT
  TCP    127.0.0.1:59309        127.0.0.1:7056         TIME_WAIT
  TCP    127.0.0.1:59310        127.0.0.1:7056         TIME_WAIT
  TCP    127.0.0.1:59317        127.0.0.1:7055         TIME_WAIT
  TCP    127.0.0.1:59323        127.0.0.1:7055         TIME_WAIT
  TCP    127.0.0.1:59327        127.0.0.1:7055         TIME_WAIT
  TCP    127.0.0.1:59329        127.0.0.1:7055         TIME_WAIT
  TCP    127.0.0.1:59336        127.0.0.1:7055         TIME_WAIT
  TCP    127.0.0.1:59337        127.0.0.1:7055         TIME_WAIT
  TCP    127.0.0.1:59338        127.0.0.1:7055         TIME_WAIT
  TCP    127.0.0.1:59339        127.0.0.1:7055         TIME_WAIT
  TCP    127.0.0.1:59340        127.0.0.1:7055         TIME_WAIT
  TCP    127.0.0.1:59341        127.0.0.1:7055         TIME_WAIT
  TCP    127.0.0.1:59342        127.0.0.1:7055         TIME_WAIT
  TCP    127.0.0.1:59343        127.0.0.1:7055         TIME_WAIT
  TCP    127.0.0.1:59344        127.0.0.1:7055         TIME_WAIT
  TCP    127.0.0.1:59354        127.0.0.1:7055         TIME_WAIT
  TCP    127.0.0.1:59355        127.0.0.1:7055         TIME_WAIT
  TCP    127.0.0.1:59356        127.0.0.1:7055         TIME_WAIT
  TCP    127.0.0.1:59357        127.0.0.1:7055         TIME_WAIT
  TCP    127.0.0.1:59358        127.0.0.1:7055         TIME_WAIT
  TCP    127.0.0.1:59363        127.0.0.1:7055         TIME_WAIT
  TCP    127.0.0.1:59364        127.0.0.1:7055         TIME_WAIT
  TCP    127.0.0.1:59365        127.0.0.1:7055         TIME_WAIT
  TCP    127.0.0.1:59366        127.0.0.1:7055         TIME_WAIT
  TCP    127.0.0.1:59367        127.0.0.1:7055         TIME_WAIT
  TCP    127.0.0.1:59368        127.0.0.1:7055         TIME_WAIT
  TCP    127.0.0.1:59369        127.0.0.1:7055         TIME_WAIT
  TCP    127.0.0.1:59370        127.0.0.1:7055         TIME_WAIT
  TCP    127.0.0.1:59371        127.0.0.1:7055         TIME_WAIT
  TCP    127.0.0.1:59373        127.0.0.1:7055         TIME_WAIT
  TCP    127.0.0.1:59375        127.0.0.1:7055         TIME_WAIT
  TCP    127.0.0.1:59376        127.0.0.1:7055         TIME_WAIT
  TCP    127.0.0.1:59377        127.0.0.1:7055         TIME_WAIT
  TCP    127.0.0.1:59378        127.0.0.1:7055         TIME_WAIT
  TCP    127.0.0.1:59379        127.0.0.1:7055         TIME_WAIT
  TCP    127.0.0.1:59380        127.0.0.1:7055         TIME_WAIT
  TCP    127.0.0.1:59381        127.0.0.1:7055         TIME_WAIT
  TCP    127.0.0.1:59382        127.0.0.1:7055         TIME_WAIT
  TCP    127.0.0.1:59383        127.0.0.1:7055         TIME_WAIT
  TCP    127.0.0.1:59384        127.0.0.1:7055         TIME_WAIT
  TCP    127.0.0.1:59385        127.0.0.1:7055         TIME_WAIT
  TCP    127.0.0.1:59386        127.0.0.1:7055         TIME_WAIT
  TCP    127.0.0.1:59387        127.0.0.1:7055         TIME_WAIT
  TCP    127.0.0.1:59388        127.0.0.1:7055         TIME_WAIT
  TCP    127.0.0.1:59389        127.0.0.1:7055         TIME_WAIT
  TCP    127.0.0.1:59390        127.0.0.1:7055         TIME_WAIT
  TCP    127.0.0.1:59391        127.0.0.1:7055         TIME_WAIT
  TCP    127.0.0.1:59392        127.0.0.1:7055         TIME_WAIT
  TCP    127.0.0.1:59393        127.0.0.1:7055         TIME_WAIT
  TCP    127.0.0.1:59394        127.0.0.1:7055         TIME_WAIT
  TCP    127.0.0.1:59395        127.0.0.1:7055         TIME_WAIT
  TCP    127.0.0.1:59396        127.0.0.1:7055         TIME_WAIT
  TCP    127.0.0.1:59397        127.0.0.1:7055         TIME_WAIT
  TCP    127.0.0.1:59398        127.0.0.1:7055         TIME_WAIT
  TCP    127.0.0.1:59399        127.0.0.1:7055         TIME_WAIT
  TCP    127.0.0.1:59400        127.0.0.1:7055         TIME_WAIT
  TCP    127.0.0.1:59401        127.0.0.1:7055         TIME_WAIT
  TCP    127.0.0.1:59402        127.0.0.1:7055         TIME_WAIT
  TCP    127.0.0.1:59403        127.0.0.1:7055         TIME_WAIT
  TCP    127.0.0.1:59404        127.0.0.1:7055         TIME_WAIT
  TCP    127.0.0.1:59405        127.0.0.1:7055         TIME_WAIT
  TCP    127.0.0.1:59406        127.0.0.1:7055         TIME_WAIT
  TCP    127.0.0.1:59407        127.0.0.1:7055         TIME_WAIT
  TCP    127.0.0.1:59408        127.0.0.1:7055         TIME_WAIT
  TCP    127.0.0.1:59409        127.0.0.1:7055         TIME_WAIT
  TCP    127.0.0.1:59410        127.0.0.1:7055         TIME_WAIT
  TCP    127.0.0.1:59411        127.0.0.1:7055         TIME_WAIT
  TCP    127.0.0.1:59412        127.0.0.1:7055         TIME_WAIT
  TCP    127.0.0.1:59413        127.0.0.1:7055         TIME_WAIT
  TCP    127.0.0.1:59414        127.0.0.1:7055         TIME_WAIT
  TCP    127.0.0.1:59415        127.0.0.1:7055         TIME_WAIT
  TCP    127.0.0.1:59416        127.0.0.1:7055         TIME_WAIT
  TCP    127.0.0.1:59417        127.0.0.1:7055         TIME_WAIT
  TCP    127.0.0.1:59418        127.0.0.1:7055         TIME_WAIT
  TCP    127.0.0.1:59419        127.0.0.1:7055         TIME_WAIT
  TCP    127.0.0.1:59420        127.0.0.1:7055         TIME_WAIT
  TCP    127.0.0.1:59421        127.0.0.1:7055         TIME_WAIT
  TCP    127.0.0.1:59422        127.0.0.1:7055         TIME_WAIT
  TCP    127.0.0.1:59423        127.0.0.1:7055         TIME_WAIT
  TCP    127.0.0.1:59424        127.0.0.1:7055         TIME_WAIT
  TCP    127.0.0.1:59425        127.0.0.1:7055         TIME_WAIT
  TCP    127.0.0.1:59426        127.0.0.1:7055         TIME_WAIT
  TCP    127.0.0.1:59427        127.0.0.1:7055         TIME_WAIT
  TCP    127.0.0.1:59428        127.0.0.1:7055         TIME_WAIT
  TCP    127.0.0.1:59429        127.0.0.1:7055         TIME_WAIT
  TCP    127.0.0.1:59430        127.0.0.1:7055         TIME_WAIT
  TCP    127.0.0.1:59431        127.0.0.1:7055         TIME_WAIT
  TCP    127.0.0.1:59432        127.0.0.1:7055         TIME_WAIT
  TCP    127.0.0.1:59433        127.0.0.1:7055         TIME_WAIT
  TCP    127.0.0.1:59434        127.0.0.1:7055         TIME_WAIT
  TCP    127.0.0.1:59435        127.0.0.1:7055         TIME_WAIT
  TCP    127.0.0.1:59436        127.0.0.1:7055         TIME_WAIT
  TCP    127.0.0.1:59437        127.0.0.1:7055         TIME_WAIT
  TCP    127.0.0.1:59438        127.0.0.1:7055         TIME_WAIT
  TCP    127.0.0.1:59439        127.0.0.1:7055         TIME_WAIT
  TCP    127.0.0.1:59440        127.0.0.1:7055         TIME_WAIT
  TCP    127.0.0.1:59441        127.0.0.1:7055         TIME_WAIT
  TCP    127.0.0.1:59442        127.0.0.1:7055         TIME_WAIT
  TCP    127.0.0.1:59443        127.0.0.1:7055         TIME_WAIT
  TCP    127.0.0.1:59444        127.0.0.1:7055         TIME_WAIT
  TCP    127.0.0.1:59445        127.0.0.1:7055         TIME_WAIT
  TCP    127.0.0.1:59446        127.0.0.1:7055         TIME_WAIT
  TCP    127.0.0.1:59447        127.0.0.1:7055         TIME_WAIT
  TCP    127.0.0.1:59448        127.0.0.1:7055         TIME_WAIT
  TCP    127.0.0.1:59449        127.0.0.1:7055         TIME_WAIT
  TCP    127.0.0.1:59450        127.0.0.1:7055         TIME_WAIT
  TCP    127.0.0.1:59451        127.0.0.1:7055         TIME_WAIT
  TCP    127.0.0.1:59452        127.0.0.1:7055         TIME_WAIT



#149672 No buffer space available (maximum connections reached?): connect

Отправлено автор: thepauloo89 22 марта 2016 - 10:18 в Selenium - Functional Testing

в консоле выполните команду:

netstat -n > C:/1.txt

Прикрепите получившийся файл сюда.

 

ПС: вообще в этом выводе могут содержаться ваши личные данные, типа советую закрыть вкладки с порнухой в браузере прежде чем выполнять команду и выкладывать сюда =)

так скажите что там должно было быть и что там менять




#149671 No buffer space available (maximum connections reached?): connect

Отправлено автор: thepauloo89 22 марта 2016 - 10:18 в Selenium - Functional Testing

причем когда я использовал Junit такой проблемы не было




#149668 No buffer space available (maximum connections reached?): connect

Отправлено автор: thepauloo89 22 марта 2016 - 09:16 в Selenium - Functional Testing

Попробуйте использовать другой порт с номером менее 5000

а где меняются эти настройки ?




#149664 No buffer space available (maximum connections reached?): connect

Отправлено автор: thepauloo89 22 марта 2016 - 08:42 в Selenium - Functional Testing

Есть проект в IntelliJ IDEA 15 JDK 1.8 TestNG
В проекте два класса в одном 8 тестов в другом 4.
Запускаю тесты правой кнопкой мыши на класс с тестами, нажимая Run по очереди на оба класса.
При этом в тестах такая аннотация, и для каждого теста запускается новый webDriver.
@BeforeMethod
public void setUp() {


driver = new FirefoxDriver();
driver.get("http://web-05.test.cbtc.ru/");
}

@AfterMethod
public void closeDriver() {
driver.quit();
}
 
Про эту ошибку гуглил кое где написано что проблема в ОС скачал фикс обновление для системы не помогло.
падает вот такая ошибка.
 
"C:\Program Files\Java\jdk1.8.0_73\bin\java" -ea -Didea.launcher.port=7533 "-Didea.launcher.bin.path=C:\Program Files (x86)\JetBrains\IntelliJ IDEA Community Edition 15.0.4\bin" -Didea.testng.sm_runner -Dfile.encoding=UTF-8 -classpath "C:\Program Files (x86)\JetBrains\IntelliJ IDEA Community Edition 15.0.4\lib\idea_rt.jar;C:\Program Files (x86)\JetBrains\IntelliJ IDEA Community Edition 15.0.4\plugins\testng\lib\testng-plugin.jar;C:\Program Files\Java\jdk1.8.0_73\jre\lib\charsets.jar;C:\Program Files\Java\jdk1.8.0_73\jre\lib\deploy.jar;C:\Program Files\Java\jdk1.8.0_73\jre\lib\ext\access-bridge-64.jar;C:\Program Files\Java\jdk1.8.0_73\jre\lib\ext\cldrdata.jar;C:\Program Files\Java\jdk1.8.0_73\jre\lib\ext\dnsns.jar;C:\Program Files\Java\jdk1.8.0_73\jre\lib\ext\jaccess.jar;C:\Program Files\Java\jdk1.8.0_73\jre\lib\ext\jfxrt.jar;C:\Program Files\Java\jdk1.8.0_73\jre\lib\ext\localedata.jar;C:\Program Files\Java\jdk1.8.0_73\jre\lib\ext\nashorn.jar;C:\Program Files\Java\jdk1.8.0_73\jre\lib\ext\sunec.jar;C:\Program Files\Java\jdk1.8.0_73\jre\lib\ext\sunjce_provider.jar;C:\Program Files\Java\jdk1.8.0_73\jre\lib\ext\sunmscapi.jar;C:\Program Files\Java\jdk1.8.0_73\jre\lib\ext\sunpkcs11.jar;C:\Program Files\Java\jdk1.8.0_73\jre\lib\ext\zipfs.jar;C:\Program Files\Java\jdk1.8.0_73\jre\lib\javaws.jar;C:\Program Files\Java\jdk1.8.0_73\jre\lib\jce.jar;C:\Program Files\Java\jdk1.8.0_73\jre\lib\jfr.jar;C:\Program Files\Java\jdk1.8.0_73\jre\lib\jfxswt.jar;C:\Program Files\Java\jdk1.8.0_73\jre\lib\jsse.jar;C:\Program Files\Java\jdk1.8.0_73\jre\lib\management-agent.jar;C:\Program Files\Java\jdk1.8.0_73\jre\lib\plugin.jar;C:\Program Files\Java\jdk1.8.0_73\jre\lib\resources.jar;C:\Program Files\Java\jdk1.8.0_73\jre\lib\rt.jar;C:\!Idea\TestTravel_2.0\TestTravel_2.0\target\test-classes;C:\!Idea\TestTravel_2.0\TestTravel_2.0\target\classes;C:\Users\NaumenkoP\.m2\repository\org\seleniumhq\selenium\selenium-server\2.52.0\selenium-server-2.52.0.jar;C:\Users\NaumenkoP\.m2\repository\com\beust\jcommander\1.48\jcommander-1.48.jar;C:\Users\NaumenkoP\.m2\repository\org\bouncycastle\bcprov-jdk15on\1.48\bcprov-jdk15on-1.48.jar;C:\Users\NaumenkoP\.m2\repository\org\bouncycastle\bcpkix-jdk15on\1.48\bcpkix-jdk15on-1.48.jar;C:\Users\NaumenkoP\.m2\repository\mx4j\mx4j-tools\3.0.1\mx4j-tools-3.0.1.jar;C:\Users\NaumenkoP\.m2\repository\org\seleniumhq\selenium\jetty-repacked\9.2.13.v20150730\jetty-repacked-9.2.13.v20150730.jar;C:\Users\NaumenkoP\.m2\repository\javax\servlet\javax.servlet-api\3.1.0\javax.servlet-api-3.1.0.jar;C:\Users\NaumenkoP\.m2\repository\org\seleniumhq\selenium\jetty-rc-repacked\5\jetty-rc-repacked-5.jar;C:\Users\NaumenkoP\.m2\repository\net\jcip\jcip-annotations\1.0\jcip-annotations-1.0.jar;C:\Users\NaumenkoP\.m2\repository\org\seleniumhq\selenium\selenium-java\2.52.0\selenium-java-2.52.0.jar;C:\Users\NaumenkoP\.m2\repository\org\seleniumhq\selenium\selenium-chrome-driver\2.52.0\selenium-chrome-driver-2.52.0.jar;C:\Users\NaumenkoP\.m2\repository\org\seleniumhq\selenium\selenium-remote-driver\2.52.0\selenium-remote-driver-2.52.0.jar;C:\Users\NaumenkoP\.m2\repository\cglib\cglib-nodep\2.1_3\cglib-nodep-2.1_3.jar;C:\Users\NaumenkoP\.m2\repository\com\google\code\gson\gson\2.3.1\gson-2.3.1.jar;C:\Users\NaumenkoP\.m2\repository\org\seleniumhq\selenium\selenium-api\2.52.0\selenium-api-2.52.0.jar;C:\Users\NaumenkoP\.m2\repository\com\google\guava\guava\19.0\guava-19.0.jar;C:\Users\NaumenkoP\.m2\repository\org\seleniumhq\selenium\selenium-edge-driver\2.52.0\selenium-edge-driver-2.52.0.jar;C:\Users\NaumenkoP\.m2\repository\commons-io\commons-io\2.4\commons-io-2.4.jar;C:\Users\NaumenkoP\.m2\repository\org\apache\commons\commons-exec\1.3\commons-exec-1.3.jar;C:\Users\NaumenkoP\.m2\repository\org\seleniumhq\selenium\selenium-htmlunit-driver\2.52.0\selenium-htmlunit-driver-2.52.0.jar;C:\Users\NaumenkoP\.m2\repository\net\sourceforge\htmlunit\htmlunit\2.18\htmlunit-2.18.jar;C:\Users\NaumenkoP\.m2\repository\xalan\xalan\2.7.2\xalan-2.7.2.jar;C:\Users\NaumenkoP\.m2\repository\xalan\serializer\2.7.2\serializer-2.7.2.jar;C:\Users\NaumenkoP\.m2\repository\org\apache\commons\commons-lang3\3.4\commons-lang3-3.4.jar;C:\Users\NaumenkoP\.m2\repository\org\apache\httpcomponents\httpmime\4.5\httpmime-4.5.jar;C:\Users\NaumenkoP\.m2\repository\net\sourceforge\htmlunit\htmlunit-core-js\2.17\htmlunit-core-js-2.17.jar;C:\Users\NaumenkoP\.m2\repository\xerces\xercesImpl\2.11.0\xercesImpl-2.11.0.jar;C:\Users\NaumenkoP\.m2\repository\xml-apis\xml-apis\1.4.01\xml-apis-1.4.01.jar;C:\Users\NaumenkoP\.m2\repository\net\sourceforge\nekohtml\nekohtml\1.9.22\nekohtml-1.9.22.jar;C:\Users\NaumenkoP\.m2\repository\net\sourceforge\cssparser\cssparser\0.9.16\cssparser-0.9.16.jar;C:\Users\NaumenkoP\.m2\repository\org\w3c\css\sac\1.3\sac-1.3.jar;C:\Users\NaumenkoP\.m2\repository\commons-logging\commons-logging\1.2\commons-logging-1.2.jar;C:\Users\NaumenkoP\.m2\repository\org\eclipse\jetty\websocket\websocket-client\9.2.12.v20150709\websocket-client-9.2.12.v20150709.jar;C:\Users\NaumenkoP\.m2\repository\org\eclipse\jetty\jetty-util\9.2.12.v20150709\jetty-util-9.2.12.v20150709.jar;C:\Users\NaumenkoP\.m2\repository\org\eclipse\jetty\jetty-io\9.2.12.v20150709\jetty-io-9.2.12.v20150709.jar;C:\Users\NaumenkoP\.m2\repository\org\eclipse\jetty\websocket\websocket-common\9.2.12.v20150709\websocket-common-9.2.12.v20150709.jar;C:\Users\NaumenkoP\.m2\repository\org\eclipse\jetty\websocket\websocket-api\9.2.12.v20150709\websocket-api-9.2.12.v20150709.jar;C:\Users\NaumenkoP\.m2\repository\commons-collections\commons-collections\3.2.2\commons-collections-3.2.2.jar;C:\Users\NaumenkoP\.m2\repository\org\apache\httpcomponents\httpclient\4.5.1\httpclient-4.5.1.jar;C:\Users\NaumenkoP\.m2\repository\org\apache\httpcomponents\httpcore\4.4.3\httpcore-4.4.3.jar;C:\Users\NaumenkoP\.m2\repository\org\seleniumhq\selenium\selenium-firefox-driver\2.52.0\selenium-firefox-driver-2.52.0.jar;C:\Users\NaumenkoP\.m2\repository\org\seleniumhq\selenium\selenium-ie-driver\2.52.0\selenium-ie-driver-2.52.0.jar;C:\Users\NaumenkoP\.m2\repository\net\java\dev\jna\jna\4.1.0\jna-4.1.0.jar;C:\Users\NaumenkoP\.m2\repository\net\java\dev\jna\jna-platform\4.1.0\jna-platform-4.1.0.jar;C:\Users\NaumenkoP\.m2\repository\org\seleniumhq\selenium\selenium-safari-driver\2.52.0\selenium-safari-driver-2.52.0.jar;C:\Users\NaumenkoP\.m2\repository\org\seleniumhq\selenium\selenium-support\2.52.0\selenium-support-2.52.0.jar;C:\Users\NaumenkoP\.m2\repository\org\webbitserver\webbit\0.4.14\webbit-0.4.14.jar;C:\Users\NaumenkoP\.m2\repository\io\netty\netty\3.5.2.Final\netty-3.5.2.Final.jar;C:\Users\NaumenkoP\.m2\repository\org\seleniumhq\selenium\selenium-leg-rc\2.52.0\selenium-leg-rc-2.52.0.jar;C:\Users\NaumenkoP\.m2\repository\org\yaml\snakeyaml\1.8\snakeyaml-1.8.jar;C:\Users\NaumenkoP\.m2\repository\commons-codec\commons-codec\1.10\commons-codec-1.10.jar;C:\Users\NaumenkoP\.m2\repository\org\testng\testng\6.8\testng-6.8.jar;C:\Users\NaumenkoP\.m2\repository\junit\junit\4.10\junit-4.10.jar;C:\Users\NaumenkoP\.m2\repository\org\hamcrest\hamcrest-core\1.1\hamcrest-core-1.1.jar;C:\Users\NaumenkoP\.m2\repository\org\beanshell\bsh\2.0b4\bsh-2.0b4.jar;C:\Program Files (x86)\JetBrains\IntelliJ IDEA Community Edition 15.0.4\plugins\testng\lib\jcommander.jar" com.intellij.rt.execution.application.AppMain org.testng.RemoteTestNGStarter -port 53111 -usedefaultlisteners false -socket53112 @w@C:\Users\NaumenkoP\AppData\Local\Temp\idea_working_dirs_testng1.tmp -temp C:\Users\NaumenkoP\AppData\Local\Temp\idea_testng1.tmp
[TestNG] Running:
  C:\Users\NaumenkoP\.IdeaIC15\system\temp-testng-customsuite.xml
мар 22, 2016 11:29:51 AM org.apache.http.impl.execchain.RetryExec execute
INFO: I/O exception (java.net.SocketException) caught when processing request to {}->http://127.0.0.1:7055: No buffer space available (maximum connections reached?): connect
мар 22, 2016 11:29:51 AM org.apache.http.impl.execchain.RetryExec execute
INFO: Retrying request to {}->http://127.0.0.1:7055
мар 22, 2016 11:29:51 AM org.apache.http.impl.execchain.RetryExec execute
INFO: I/O exception (java.net.SocketException) caught when processing request to {}->http://127.0.0.1:7055: No buffer space available (maximum connections reached?): connect
мар 22, 2016 11:29:51 AM org.apache.http.impl.execchain.RetryExec execute
INFO: Retrying request to {}->http://127.0.0.1:7055
мар 22, 2016 11:29:51 AM org.apache.http.impl.execchain.RetryExec execute
INFO: I/O exception (java.net.SocketException) caught when processing request to {}->http://127.0.0.1:7055: No buffer space available (maximum connections reached?): connect
мар 22, 2016 11:29:52 AM org.apache.http.impl.execchain.RetryExec execute
INFO: Retrying request to {}->http://127.0.0.1:7055
 
мар 22, 2016 11:29:52 AM org.apache.http.impl.execchain.RetryExec execute
INFO: I/O exception (java.net.SocketException) caught when processing request to {}->http://127.0.0.1:7055: No buffer space available (maximum connections reached?): connect
мар 22, 2016 11:29:52 AM org.apache.http.impl.execchain.RetryExec execute
INFO: Retrying request to {}->http://127.0.0.1:7055
мар 22, 2016 11:29:52 AM org.apache.http.impl.execchain.RetryExec execute
INFO: I/O exception (java.net.SocketException) caught when processing request to {}->http://127.0.0.1:7055: No buffer space available (maximum connections reached?): connect
мар 22, 2016 11:29:52 AM org.apache.http.impl.execchain.RetryExec execute
INFO: Retrying request to {}->http://127.0.0.1:7055
мар 22, 2016 11:29:52 AM org.apache.http.impl.execchain.RetryExec execute
INFO: I/O exception (java.net.SocketException) caught when processing request to {}->http://127.0.0.1:7055: No buffer space available (maximum connections reached?): connect
мар 22, 2016 11:29:52 AM org.apache.http.impl.execchain.RetryExec execute
INFO: Retrying request to {}->http://127.0.0.1:7055
 
org.openqa.selenium.remote.UnreachableBrowserException: Error communicating with the remote browser. It may have died.
Build info: version: '2.52.0', revision: '4c2593cfc3689a7fcd7be52549167e5ccc93ad28', time: '2016-02-11 11:22:43'
System info: host: 'MSC-CO-WS416', ip: '172.31.4.108', os.name: 'Windows 7', os.arch: 'amd64', os.version: '6.1', java.version: '1.8.0_73'
Driver info: driver.version: RemoteWebDriver
Capabilities [{applicationCacheEnabled=true, rotatable=false, handlesAlerts=true, databaseEnabled=true, version=41.0.2, platform=WINDOWS, nativeEvents=false, acceptSslCerts=true, webStorageEnabled=true, locationContextEnabled=true, browserName=firefox, takesScreenshot=true, javascriptEnabled=true, cssSelectorsEnabled=true}]
Session ID: 375763ac-e5ec-4e87-8dd2-8b914242b3e8
 
at org.openqa.selenium.remote.RemoteWebDriver.execute(RemoteWebDriver.java:665)
at org.openqa.selenium.remote.RemoteWebDriver.executeScript(RemoteWebDriver.java:577)
at main.Travelclick.waitForAjaxToFinish(Travelclick.java:40)
at main.Travelclick.<init>(Travelclick.java:24)
at main.AeroTab.<init>(AeroTab.java:13)
at main.AeroKoordinTest.aeroKoordinatorRoundtripSochiMocsowShedulerEconom(AeroKoordinTest.java:100)
at sun.reflect.NativeMethodAccessorImpl.invoke0(Native Method)
at sun.reflect.NativeMethodAccessorImpl.invoke(NativeMethodAccessorImpl.java:62)
at sun.reflect.DelegatingMethodAccessorImpl.invoke(DelegatingMethodAccessorImpl.java:43)
at java.lang.reflect.Method.invoke(Method.java:497)
at org.testng.internal.MethodInvocationHelper.invokeMethod(MethodInvocationHelper.java:80)
at org.testng.internal.Invoker.invokeMethod(Invoker.java:714)
at org.testng.internal.Invoker.invokeTestMethod(Invoker.java:901)
at org.testng.internal.Invoker.invokeTestMethods(Invoker.java:1231)
at org.testng.internal.TestMethodWorker.invokeTestMethods(TestMethodWorker.java:127)
at org.testng.internal.TestMethodWorker.run(TestMethodWorker.java:111)
at org.testng.TestRunner.privateRun(TestRunner.java:767)
at org.testng.TestRunner.run(TestRunner.java:617)
at org.testng.SuiteRunner.runTest(SuiteRunner.java:334)
at org.testng.SuiteRunner.runSequentially(SuiteRunner.java:329)
at org.testng.SuiteRunner.privateRun(SuiteRunner.java:291)
at org.testng.SuiteRunner.run(SuiteRunner.java:240)
at org.testng.SuiteRunnerWorker.runSuite(SuiteRunnerWorker.java:52)
at org.testng.SuiteRunnerWorker.run(SuiteRunnerWorker.java:86)
at org.testng.TestNG.runSuitesSequentially(TestNG.java:1198)
at org.testng.TestNG.runSuitesLocally(TestNG.java:1123)
at org.testng.TestNG.run(TestNG.java:1031)
at org.testng.IDEARemoteTestNG.run(IDEARemoteTestNG.java:72)
at org.testng.RemoteTestNGStarter.main(RemoteTestNGStarter.java:122)
at sun.reflect.NativeMethodAccessorImpl.invoke0(Native Method)
at sun.reflect.NativeMethodAccessorImpl.invoke(NativeMethodAccessorImpl.java:62)
at sun.reflect.DelegatingMethodAccessorImpl.invoke(DelegatingMethodAccessorImpl.java:43)
at java.lang.reflect.Method.invoke(Method.java:497)
at com.intellij.rt.execution.application.AppMain.main(AppMain.java:144)
Caused by: java.net.SocketException: No buffer space available (maximum connections reached?): connect
at java.net.DualStackPlainSocketImpl.connect0(Native Method)
at java.net.DualStackPlainSocketImpl.socketConnect(DualStackPlainSocketImpl.java:83)
at java.net.AbstractPlainSocketImpl.doConnect(AbstractPlainSocketImpl.java:350)
at java.net.AbstractPlainSocketImpl.connectToAddress(AbstractPlainSocketImpl.java:206)
at java.net.AbstractPlainSocketImpl.connect(AbstractPlainSocketImpl.java:188)
at java.net.PlainSocketImpl.connect(PlainSocketImpl.java:172)
at java.net.SocksSocketImpl.connect(SocksSocketImpl.java:392)
at java.net.Socket.connect(Socket.java:589)
at org.apache.http.conn.socket.PlainConnectionSocketFactory.connectSocket(PlainConnectionSocketFactory.java:74)
at org.apache.http.impl.conn.DefaultHttpClientConnectionOperator.connect(DefaultHttpClientConnectionOperator.java:134)
at org.apache.http.impl.conn.PoolingHttpClientConnectionManager.connect(PoolingHttpClientConnectionManager.java:353)
at org.apache.http.impl.execchain.MainClientExec.establishRoute(MainClientExec.java:380)
at org.apache.http.impl.execchain.MainClientExec.execute(MainClientExec.java:236)
at org.apache.http.impl.execchain.ProtocolExec.execute(ProtocolExec.java:184)
at org.apache.http.impl.execchain.RetryExec.execute(RetryExec.java:88)
at org.apache.http.impl.execchain.RedirectExec.execute(RedirectExec.java:110)
at org.apache.http.impl.client.InternalHttpClient.doExecute(InternalHttpClient.java:184)
at org.apache.http.impl.client.CloseableHttpClient.execute(CloseableHttpClient.java:71)
at org.apache.http.impl.client.CloseableHttpClient.execute(CloseableHttpClient.java:55)
at org.openqa.selenium.remote.internal.ApacheHttpClient.fallBackExecute(ApacheHttpClient.java:144)
at org.openqa.selenium.remote.internal.ApacheHttpClient.execute(ApacheHttpClient.java:90)
at org.openqa.selenium.remote.HttpCommandExecutor.execute(HttpCommandExecutor.java:142)
at org.openqa.selenium.firefox.internal.NewProfileExtensionConnection.execute(NewProfileExtensionConnection.java:160)
at org.openqa.selenium.firefox.FirefoxDriver$LazyCommandExecutor.execute(FirefoxDriver.java:380)
at org.openqa.selenium.remote.RemoteWebDriver.execute(RemoteWebDriver.java:644)
... 33 more
 
 
org.openqa.selenium.remote.UnreachableBrowserException: Error communicating with the remote browser. It may have died.
Build info: version: '2.52.0', revision: '4c2593cfc3689a7fcd7be52549167e5ccc93ad28', time: '2016-02-11 11:22:43'
System info: host: 'MSC-CO-WS416', ip: '172.31.4.108', os.name: 'Windows 7', os.arch: 'amd64', os.version: '6.1', java.version: '1.8.0_73'
Driver info: driver.version: RemoteWebDriver
Capabilities [{applicationCacheEnabled=true, rotatable=false, handlesAlerts=true, databaseEnabled=true, version=41.0.2, platform=WINDOWS, nativeEvents=false, acceptSslCerts=true, webStorageEnabled=true, locationContextEnabled=true, browserName=firefox, takesScreenshot=true, javascriptEnabled=true, cssSelectorsEnabled=true}]
Session ID: 375763ac-e5ec-4e87-8dd2-8b914242b3e8
 
at org.openqa.selenium.remote.RemoteWebDriver.execute(RemoteWebDriver.java:665)
at org.openqa.selenium.remote.RemoteWebDriver.execute(RemoteWebDriver.java:701)
at org.openqa.selenium.remote.RemoteWebDriver.quit(RemoteWebDriver.java:526)
at main.AeroKoordinTest.closeDriver(AeroKoordinTest.java:31)
at sun.reflect.NativeMethodAccessorImpl.invoke0(Native Method)
at sun.reflect.NativeMethodAccessorImpl.invoke(NativeMethodAccessorImpl.java:62)
at sun.reflect.DelegatingMethodAccessorImpl.invoke(DelegatingMethodAccessorImpl.java:43)
at java.lang.reflect.Method.invoke(Method.java:497)
at org.testng.internal.MethodInvocationHelper.invokeMethod(MethodInvocationHelper.java:80)
at org.testng.internal.Invoker.invokeConfigurationMethod(Invoker.java:564)
at org.testng.internal.Invoker.invokeConfigurations(Invoker.java:213)
at org.testng.internal.Invoker.invokeMethod(Invoker.java:786)
at org.testng.internal.Invoker.invokeTestMethod(Invoker.java:901)
at org.testng.internal.Invoker.invokeTestMethods(Invoker.java:1231)
at org.testng.internal.TestMethodWorker.invokeTestMethods(TestMethodWorker.java:127)
at org.testng.internal.TestMethodWorker.run(TestMethodWorker.java:111)
at org.testng.TestRunner.privateRun(TestRunner.java:767)
at org.testng.TestRunner.run(TestRunner.java:617)
at org.testng.SuiteRunner.runTest(SuiteRunner.java:334)
at org.testng.SuiteRunner.runSequentially(SuiteRunner.java:329)
at org.testng.SuiteRunner.privateRun(SuiteRunner.java:291)
at org.testng.SuiteRunner.run(SuiteRunner.java:240)
at org.testng.SuiteRunnerWorker.runSuite(SuiteRunnerWorker.java:52)
at org.testng.SuiteRunnerWorker.run(SuiteRunnerWorker.java:86)
at org.testng.TestNG.runSuitesSequentially(TestNG.java:1198)
at org.testng.TestNG.runSuitesLocally(TestNG.java:1123)
at org.testng.TestNG.run(TestNG.java:1031)
at org.testng.IDEARemoteTestNG.run(IDEARemoteTestNG.java:72)
at org.testng.RemoteTestNGStarter.main(RemoteTestNGStarter.java:122)
at sun.reflect.NativeMethodAccessorImpl.invoke0(Native Method)
at sun.reflect.NativeMethodAccessorImpl.invoke(NativeMethodAccessorImpl.java:62)
at sun.reflect.DelegatingMethodAccessorImpl.invoke(DelegatingMethodAccessorImpl.java:43)
at java.lang.reflect.Method.invoke(Method.java:497)
at com.intellij.rt.execution.application.AppMain.main(AppMain.java:144)
Caused by: java.net.SocketException: No buffer space available (maximum connections reached?): connect
at java.net.DualStackPlainSocketImpl.connect0(Native Method)
at java.net.DualStackPlainSocketImpl.socketConnect(DualStackPlainSocketImpl.java:83)
at java.net.AbstractPlainSocketImpl.doConnect(AbstractPlainSocketImpl.java:350)
at java.net.AbstractPlainSocketImpl.connectToAddress(AbstractPlainSocketImpl.java:206)
at java.net.AbstractPlainSocketImpl.connect(AbstractPlainSocketImpl.java:188)
at java.net.PlainSocketImpl.connect(PlainSocketImpl.java:172)
at java.net.SocksSocketImpl.connect(SocksSocketImpl.java:392)
at java.net.Socket.connect(Socket.java:589)
at org.apache.http.conn.socket.PlainConnectionSocketFactory.connectSocket(PlainConnectionSocketFactory.java:74)
at org.apache.http.impl.conn.DefaultHttpClientConnectionOperator.connect(DefaultHttpClientConnectionOperator.java:134)
at org.apache.http.impl.conn.PoolingHttpClientConnectionManager.connect(PoolingHttpClientConnectionManager.java:353)
at org.apache.http.impl.execchain.MainClientExec.establishRoute(MainClientExec.java:380)
at org.apache.http.impl.execchain.MainClientExec.execute(MainClientExec.java:236)
at org.apache.http.impl.execchain.ProtocolExec.execute(ProtocolExec.java:184)
at org.apache.http.impl.execchain.RetryExec.execute(RetryExec.java:88)
at org.apache.http.impl.execchain.RedirectExec.execute(RedirectExec.java:110)
at org.apache.http.impl.client.InternalHttpClient.doExecute(InternalHttpClient.java:184)
at org.apache.http.impl.client.CloseableHttpClient.execute(CloseableHttpClient.java:71)
at org.apache.http.impl.client.CloseableHttpClient.execute(CloseableHttpClient.java:55)
at org.openqa.selenium.remote.internal.ApacheHttpClient.fallBackExecute(ApacheHttpClient.java:144)
at org.openqa.selenium.remote.internal.ApacheHttpClient.execute(ApacheHttpClient.java:90)
at org.openqa.selenium.remote.HttpCommandExecutor.execute(HttpCommandExecutor.java:142)
at org.openqa.selenium.firefox.internal.NewProfileExtensionConnection.execute(NewProfileExtensionConnection.java:160)
at org.openqa.selenium.firefox.FirefoxDriver$LazyCommandExecutor.execute(FirefoxDriver.java:380)
at org.openqa.selenium.remote.RemoteWebDriver.execute(RemoteWebDriver.java:644)
... 33 more
 
 
===============================================
Default Suite
Total tests run: 8, Failures: 1, Skips: 0
Configuration Failures: 1, Skips: 0
===============================================
 
 
Process finished with exit code 0



#149620 Ожидание аяксов

Отправлено автор: thepauloo89 21 марта 2016 - 10:37 в Selenium - Functional Testing

public void waitForAjaxToFinish() {
long currentTime = System.currentTimeMillis();
while (System.currentTimeMillis() - currentTime < 40000) {
boolean ajaxFinished = (Boolean) ((JavascriptExecutor) driver)    /// в этой строке ошибка
.executeScript("return !!jQuery && jQuery.active == 0");
if (ajaxFinished)
return;
}

throw new AssertionError("Ajax haven't finished its job in 40 sec");
}

 

на этом методе падает тест  с такой ошибкой кто нить встречался с таким?

 

INFO: I/O exception (java.net.SocketException) caught when processing request to {}->http://localhost:44505: No buffer space available (maximum connections reached?): connect

 

 




#149521 Как выбрать нужный елемент

Отправлено автор: thepauloo89 16 марта 2016 - 10:28 в Selenium - Functional Testing

 

попробуй так

String doc_num = "1231231231";
String doc_num_xpath = "//input[@docnumber='" + doc_num + "']")
driver.findElement(By.xpath(doc_num_xpath));

Спасибо за помощь уместил все это и зхаработало!!!! МУХАХАХАХХА 

сделал вот так

 

public void changeDocNum(String docNum) {
String docNumXpath = "//input[@docnumber='" + docNum + "']";
driver.findElement(By.xpath(docNumXpath)).click();
}

 

когда делал вспомнил что делал подобное с дабл кликом чтобы так же делать дабл клик на любой Элемент.




#149516 Как выбрать нужный елемент

Отправлено автор: thepauloo89 16 марта 2016 - 09:24 в Selenium - Functional Testing

package main;

import org.openqa.selenium.WebDriver;
import org.openqa.selenium.WebElement;
import org.openqa.selenium.support.FindBy;

/**
* Created by thepauloo89 on 15.03.2016.
*/
public class BookingCart extends FirstClass  {

public BookingCart(WebDriver driver) {
super(driver);}

String doc_num = "1231231231";
@FindBy (xpath = "//input[@docnumber='" + doc_num + "']") // вот это он подчеркивает и пишет attribute value must be constant
WebElement changeDocument; // выбор документа

}




#149515 Как выбрать нужный елемент

Отправлено автор: thepauloo89 16 марта 2016 - 09:19 в Selenium - Functional Testing

вот

Прикрепленные изображения

  • 33333333.jpg



#149511 Как выбрать нужный елемент

Отправлено автор: thepauloo89 16 марта 2016 - 09:06 в Selenium - Functional Testing

String doc_num = "1231231231";
@FindBy (xpath = "//input[@docnumber='" + doc_num + "']")
WebElement changeDocument; // выбор документа

я ведь не могу просто переменную создать она будет ругаться

attribute value must be constant




#149507 Как выбрать нужный елемент

Отправлено автор: thepauloo89 16 марта 2016 - 08:58 в Selenium - Functional Testing

doc_num = "123"
doc_num_search_xpath = "//input[@docnumber='" + doc_num + "']"

а можешь целиком метод описать ? я не совсем понимаю где это писать.

 

 

вот мой код

 

ublic class BookingCart extends FirstClasss {
public BookingCart(WebDriver driver) {
super(driver);}

 

вот тут нужно создать??? (

private String docnum;
@FindBy (xpath = "//input[@docnumber='" + doc_num + "']")
WebElement changeDocument; // выбор документа

 

я ведь не могу просто переменную создать она будет ругаться

attribute value must be constant





Яндекс.Метрика
Реклама на портале